sudo snap run mir-test-tools.performance-test by malt

New About Yours API Help
3.8 KB, Plain text
realpath: '': No such file or directory
realpath: '': No such file or directory
realpath: '': No such file or directory
realpath: '': No such file or directory
realpath: '': No such file or directory
realpath: '': No such file or directory
realpath: '': No such file or directory
realpath: '': No such file or directory
Running main() from main.cpp
Note: Google Test filter = -GLMark2Xwayland*:ClientLatency*
[==========] Running 6 tests from 3 test cases.
[----------] Global test environment set-up.
[----------] 4 tests from GLMark2Wayland
[ RUN      ] GLMark2Wayland.fullscreen_default
Saving GLMark2 detailed results to: /tmp/GLMark2Wayland_fullscreen_default.log
libEGL warning: DRI2: failed to create dri screen
/build/mir-sEwKID/mir-1.7.0/tests/performance-tests/test_glmark2-es2-mir.cpp:200: Failure
Value of: run_glmark2("--fullscreen")
Expected: is >= 56
  Actual: 17 (of type int)
[  FAILED  ] GLMark2Wayland.fullscreen_default (12997 ms)
[ RUN      ] GLMark2Wayland.windowed_default
Saving GLMark2 detailed results to: /tmp/GLMark2Wayland_windowed_default.log
libEGL warning: DRI2: failed to create dri screen
[       OK ] GLMark2Wayland.windowed_default (12800 ms)
[ RUN      ] GLMark2Wayland.fullscreen
Saving GLMark2 detailed results to: /tmp/GLMark2Wayland_fullscreen.log
libEGL warning: DRI2: failed to create dri screen
/build/mir-sEwKID/mir-1.7.0/tests/performance-tests/test_glmark2-es2-mir.cpp:210: Failure
Value of: run_glmark2("--fullscreen")
Expected: is >= 100
  Actual: 18 (of type int)
[  FAILED  ] GLMark2Wayland.fullscreen (12917 ms)
[ RUN      ] GLMark2Wayland.windowed
Saving GLMark2 detailed results to: /tmp/GLMark2Wayland_windowed.log
libEGL warning: DRI2: failed to create dri screen
/build/mir-sEwKID/mir-1.7.0/tests/performance-tests/test_glmark2-es2-mir.cpp:215: Failure
Value of: run_glmark2("")
Expected: is >= 100
  Actual: 56 (of type int)
[  FAILED  ] GLMark2Wayland.windowed (12799 ms)
[----------] 4 tests from GLMark2Wayland (51513 ms total)

[----------] 1 test from CompositorPerformance
[ RUN      ] CompositorPerformance.regression_test_1563287
[2020-02-29 07:14:53.593027] < -warning- > mesa-kms: Failed to detect whether device /dev/dri/card0 supports KMS, continuing with lower confidence
[2020-02-29 07:14:54.225524] < -warning- > mesa-kms: Failed to detect whether device /dev/dri/card0 supports KMS, but continuing anyway
[2020-02-29 07:14:54.840135] < -warning- > mesa-kms: Unable to determine the current display mode.
[2020-02-29 07:14:54.918712] < -warning- > mesa-kms: drmModeCrtcSetGamma failed: Function not implemented
[2020-02-29 07:14:54.954671] < -warning- > miral: Failed to load cursor theme: default
[2020-02-29 07:14:55.575696] < -warning- > miral: Failed to load cursor theme: default
/build/mir-sEwKID/mir-1.7.0/tests/performance-tests/test_compositor.cpp:67: Failure
Expected: (compositor_fps) >= (58.0f), actual: 20.318 vs 58
/build/mir-sEwKID/mir-1.7.0/tests/performance-tests/test_compositor.cpp:68: Failure
Expected: (compositor_render_time) < (17.0f), actual: 43.71 vs 17
[  FAILED  ] CompositorPerformance.regression_test_1563287 (13802 ms)
[----------] 1 test from CompositorPerformance (13802 ms total)

[----------] 1 test from ClientStartupPerformance
[ RUN      ] ClientStartupPerformance.create_surface_and_swap
[       OK ] ClientStartupPerformance.create_surface_and_swap (2315 ms)
[----------] 1 test from ClientStartupPerformance (2315 ms total)

[----------] Global test environment tear-down
[==========] 6 tests from 3 test cases ran. (67631 ms total)
[  PASSED  ] 2 tests.
[  FAILED  ] 4 tests, listed below:
[  FAILED  ] GLMark2Wayland.fullscreen_default
[  FAILED  ] GLMark2Wayland.fullscreen
[  FAILED  ] GLMark2Wayland.windowed
[  FAILED  ] CompositorPerformance.regression_test_1563287

 4 FAILED TESTS
Pasted 1 month, 1 week ago — Expires in 325 days
URL: http://dpaste.com/0ZRFV63